{"text_format":"1","workbook":"xlsx","n_sheets":11,"sheets":["P","BSL","BAKTERI","MANTAR","PARAZIT","RIKETSIYA","VIRUS","PRION","TOKSIN","A","B"],"not_rendered":{"charts":0,"images":1,"macros":1,"external_links":0,"defined_names":9,"comments":0,"pivot_tables":0},"unopened":[],"bounds":{"document_bytes":16777216,"sheet_cells":100000,"rows_first":2000,"rows_last":500,"rows_between":2000,"halvings":0,"cell_chars":16384,"cell_head_chars":4096},"cells_cut":0,"cells_raw":0,"read":"whole","date_system":"1900"}

{"sheet":"P","index":0,"n_rows":1002,"n_cols":7,"rows_kept":1002,"cut":false,"hidden":true,"merged":[]}
["Virüs",5,"Abras",2,null,null,"Virüs"]
["Virüs",5,"Absettarov",4,null,"EXHAUST HEPA REQUIRED","Virüs"]
["Mantar",2,"Absidia spp.",2,null,"TMC","Mantar"]
["Virüs",5,"Abu Hammad",2,null,null,"Virüs"]
["Virüs",5,"Acado",2,null,null,"Virüs"]
["Parazit",3,"Acanthocheilonema spp.",2,null,"TMC","Parazit"]
["Parazit",3,"Acanthomoeba spp.",2,null,"TMC","Parazit"]
["Virüs",5,"Acara",2,null,null,"Virüs"]
["Bakteri ",1,"Acinetobacter calcoaeticus",2,null,"TMC","Bakteri "]
["Bakteri ",1,"Acinetobacter lwolfi",2,null,"TMC","Bakteri "]
["Bakteri ",1,"Actinetobacter calceticus",2,2,null,"Bakteri "]
["Bakteri ",1,"Actinobacillus spp.",2,2,null,"Bakteri "]
["Bakteri ",1,"Actinomyces spp.",2,2,null,"Bakteri "]
["Virüs",5,"Adelaide River",2,null,null,"Virüs"]
["Virüs",5,"Adenoviruses",2,2,null,"Virüs"]
["Virüs",5,"Adenoviruses - animal - all",2,2,null,"Virüs"]
["Bakteri ",1,"Aeromaonas hydrophilia",2,null,"TMC","Bakteri "]
["Bakteri ",1,"Aeromaonas sp.",2,2,null,"Bakteri "]
["Virüs",5,"African Horsesickness","3c",null,"EXHAUST HEPA REQUIRED","Virüs"]
["Virüs",5,"African Swine Fever","3c",null,"EXHAUST HEPA REQUIRED","Virüs"]
["Virüs",5,"Aguacate",2,null,null,"Virüs"]
["Virüs",5,"Aino",2,null,null,"Virüs"]
["Virüs",5,"Akabane ","3c",null,"EXHAUST HEPA REQUIRED","Virüs"]
["Virüs",5,"Alenquer ",2,null,null,"Virüs"]
["Virüs",5,"Aleutian Disease Virus",2,2,null,"Virüs"]
["Virüs",5,"Alfuy",2,null,null,"Virüs"]
["Virüs",5,"Alkhumra",4,null,"EXHAUST HEPA REQUIRED","Virüs"]
["Virüs",5,"Allpahuayo",3,null,null,"Virüs"]
["Virüs",5,"Almeirim",2,null,null,"Virüs"]
["Virüs",5,"Almpiwar",2,null,null,"Virüs"]
["Virüs",5,"Altamira",2,null,null,"Virüs"]
["Virüs",5,"Amapari ",2,null,null,"Virüs"]
["Virüs",5,"Ambe",2,null,null,"Virüs"]
["Virüs",5,"Ananindeua",2,null,null,"Virüs"]
["Parazit",3,"Anaplasma spp.",2,2,null,"Parazit"]
["Parazit",3,"Ancylostoma braziliense",2,2,"BSC","Parazit"]
["Parazit",3,"Ancylostoma caninum",2,2,"BSC","Parazit"]
["Parazit",3,"Ancylostoma spp.",2,2,"BSC","Parazit"]
["Virüs",5,"Andasibe",2,null,null,"Virüs"]
["Virüs",5,"Andes","3a",null,null,"Virüs"]
["Parazit",3,"Angiostrongylus spp.",2,null,"TMC","Parazit"]
["Virüs",5,"Anhanga",2,null,null,"Virüs"]
["Virüs",5,"Anhembi",2,null,null,"Virüs"]
["Virüs",5,"Anopheles A",2,null,null,"Virüs"]
["Virüs",5,"Anopheles B",2,null,null,"Virüs"]
["Virüs",5,"Antequera",2,null,null,"Virüs"]
["Virüs",5,"Apeu",2,null,null,"Virüs"]
["Virüs",5,"Apoi",2,null,null,"Virüs"]
["Bakteri ",1,"Arachnida propionica",2,2,null,"Bakteri "]
["Virüs",5,"Araguari",3,null,null,"Virüs"]
["Virüs",5,"Aransas",2,null,null,"Virüs"]
["Virüs",5,"Arbia",2,null,null,"Virüs"]
["Virüs",5,"Arboledas",2,null,null,"Virüs"]
["Virüs",5,"Arboviruses - certain",2,2,"BMBL","Virüs"]
["Virüs",5,"Arboviruses - certain",3,3,"BMBL","Virüs"]
["Virüs",5,"Arboviruses - certain",4,4,"BMBL","Virüs"]
["Virüs",5,"Arenaviruses - certain",3,3,"BMBL","Virüs"]
["Virüs",5,"Arenaviruses - certain",4,4,"BMBL","Virüs"]
["Virüs",5,"Arenaviruses - LCM Virus","2-3",null,"TMC","Virüs"]
["Virüs",5,"Aride",2,null,null,"Virüs"]
["Virüs",5,"Ariquemes",2,null,null,"Virüs"]
["Virüs",5,"Arkonam",2,null,null,"Virüs"]
["Virüs",5,"Armero",2,null,null,"Virüs"]
["Virüs",5,"Aroa",2,null,null,"Virüs"]
["Virüs",5,"Aruac",2,null,null,"Virüs"]
["Virüs",5,"Arumateua",2,null,null,"Virüs"]
["Virüs",5,"Arumowot",2,null,null,"Virüs"]
["Parazit",3,"Ascaris lumbricoides",2,2,"BSC","Parazit"]
["Parazit",3,"Ascaris spp.",2,2,"BMBL","Parazit"]
["Mantar",2,"Aspergillus spp.",2,null,"TMC","Mantar"]
["Virüs",5,"Aura",2,null,null,"Virüs"]
["Virüs",5,"Avalon",2,null,null,"Virüs"]
["Virüs",5,"Avian Erthyroblastosis Virus",2,2,null,"Virüs"]
["Virüs",5,"Avian Leucosis Virus",2,2,null,"Virüs"]
["Virüs",5,"Avian Lymphomatosis Virus",2,2,null,"Virüs"]
["Virüs",5,"Avian Myeloblasotosos Virus",2,2,null,"Virüs"]
["Virüs",5,"Babahoyo",2,null,null,"Virüs"]
["Virüs",5,"Babanki",2,null,null,"Virüs"]
["Parazit",3,"Babesia microti",2,2,"BSC","Parazit"]
["Parazit",3,"Babesia spp.",2,null,"TMC","Parazit"]
["Bakteri ",1,"Bacillus alvei",2,2,null,"Bakteri "]
["Bakteri ",1,"Bacillus anthracis*","2-3",2,"BMBL, vaccination recommended","Bakteri "]
["Bakteri ",1,"Bacillus cereus",1,null,"TMC","Bakteri "]
["Bakteri ",1,"Bacillus subtilis",2,null,"TMC","Bakteri "]
["Bakteri ",1,"Bacteroides spp.",2,2,null,"Bakteri "]
["Virüs",5,"Bagaza",2,null,null,"Virüs"]
["Virüs",5,"Bahig",2,null,null,"Virüs"]
["Virüs",5,"Bakau",2,null,null,"Virüs"]
["Virüs",5,"Baku",2,null,null,"Virüs"]
["Parazit",3,"Balantidium spp.",2,null,"TMC","Parazit"]
["Virüs",5,"Bandia",2,null,null,"Virüs"]
["Virüs",5,"Bangoran ",2,null,null,"Virüs"]
["Virüs",5,"Bangui",2,null,null,"Virüs"]
["Virüs",5,"Banzi",2,null,null,"Virüs"]
["Virüs",5,"Barmah",2,null,null,"Virüs"]
["Virüs",5,"Barranqueras",2,null,null,"Virüs"]
["Bakteri ",1,"Bartonella bacilliformis",2,null,"TMC","Bakteri "]
["Bakteri ",1,"Bartonella sp.",3,3,null,"Bakteri "]
["Virüs",5,"Barur",2,null,null,"Virüs"]
["Virüs",5,"Batai ",2,null,null,"Virüs"]
["Virüs",5,"Batama",2,null,null,"Virüs"]
["Virüs",5,"Batken ",2,null,null,"Virüs"]
["Virüs",5,"Bauline",2,null,null,"Virüs"]
["Virüs",5,"Bear Canyon",3,null,null,"Virüs"]
["Virüs",5,"Bebaru ",2,null,null,"Virüs"]
["Virüs",5,"Belem",2,null,null,"Virüs"]
["Virüs",5,"Belmont",2,null,null,"Virüs"]
["Virüs",5,"Belterra ",2,null,null,"Virüs"]
["Virüs",5,"Benevides",2,null,null,"Virüs"]
["Virüs",5,"Benfica ",2,null,null,"Virüs"]
["Virüs",5,"Beritoga",2,null,null,"Virüs"]
["Virüs",5,"Bermejo",3,null,null,"Virüs"]
["Virüs",5,"Berrimah",2,null,null,"Virüs"]
["Virüs",5,"Bhanja",3,null,null,"Virüs"]
["Virüs",5,"Bimbo",2,null,null,"Virüs"]
["Virüs",5,"Bimitti",2,null,null,"Virüs"]
["Virüs",5,"Birao ",2,null,null,"Virüs"]
["Virüs",5,"BK Virüs","2-3",null,"TMC","Virüs"]
["Mantar",2,"Blastomyces dermatitides","2-3",2,"BMBL","Mantar"]
["Virüs",5,"Bluetoungue (exotic serotypes)","3c",null,null,"Virüs"]
{"$rows_left_out":883}
{"sheet":"BSL","index":1,"n_rows":21,"n_cols":8,"rows_kept":21,"cut":false,"hidden":false,"merged":[[5,4,6,4],[5,2,6,2],[5,3,6,3]]}
[]
[null,null,"PATOJEN MİKROORGANİZMA",null,null,null,null,"Corynebacterium diphtheriae"]
[null,null,"PATOJEN AİLESİ / TÜRÜ",null,{"$f":"IF($H$2=0,0,VLOOKUP($H$2,P!C1:G952,5,FALSE))","v":"Bakteri "}]
[null,null,"BİYOLOJİK KORUMA SEVİYESİ",null,{"$f":"IF($H$2=0,0,VLOOKUP($H$2,P!C1:F952,2,FALSE))","v":2}]
[null,null,"HAYVANSAL BİYOLOJİK KORUMA SEVİYESİ",{"$f":"IF($H$2=0,0,VLOOKUP($H$2,P!C1:F952,3,FALSE))","v":2},{"$f":"IF(D5=0,\"\",D5)","v":2}]
[null,null,"EK ÖNLEMLER",{"$f":"IF($H$2=0,0,VLOOKUP($H$2,P!C1:F952,4,FALSE))","v":"BMBL"},{"$f":"IF(D6=0,\"\",D6)","v":"BMBL"}]
[]
["BMBL",":","Amerikan Sağlık Bakanlığı, Ulusal Sağlık Enstitüsü, Hastalıkları Kontrol ve Önleme Merkezi'nin Mikrobiyolojik Güvenlik"]
[null,null,"ve Koruma Seviyeleri Kitabı'ndan alınmıştır."]
["TMC",":","Türk Mikrobiyoloji Cemiyeti Dergisinden alınmıştır (2003)"]
["BSC",":","Biyolojik Koruma Kabini (laminer kabin)"]
["*",":","Ek önlemler gerekebilir !"]
["a",":","Korunma gereklilikleri virüs yoğunluğuna, hayvan deneklere veya virüs tipine göre çok değişkendir. Hantanvirus için detaylar incelenmelidir."]
["b",":","Virüs cinsinde geçici yerleşimdedir."]
["c",":","Bu mikroorganizmalar, USDA tarafından zirai patojen olarak değerlendirilmektedir ve bu nedenle ek olarak BSL 3 seviyesinde"]
[null,null,"koruma gerektirebilirler. Çalışma yapmadan önce USDA'ya danışılmalıdır."]
["d",":","Ganjam virus'ünün bir diğer adıdır !"]
["e",":","Garissa virüsü bu virüsün ayırıcısıdır, bu nedenle aynı koruma sınıfı gereklidir !"]
["f",":","Antijen grupları A, B, and C olarak Casals, Brown, and Whitman tarfından bilinen arbovirüslere karşı karşı-reaksiyona girebilme"]
[null,null,"durumuna karşı sınıflandırılmışlardır. Grup A virüsler Alphavirus ailesindendir, grup B virüsler Flaviviridae ailesindendir,"]
[null,null,"ve grup C virüsler is Bunyaviridae ailesindendir."]

{"sheet":"BAKTERI","index":2,"n_rows":62,"n_cols":5,"rows_kept":62,"cut":false,"hidden":true,"merged":[]}
[1,"Actinetobacter calceticus",2,2]
[1,"Actinobacillus sp.",2,2]
[1,"Actinomyces sp.",2,2]
[1,"Aeromaonas sp.",2,2]
[1,"Arachnida propionica",2,2]
[1,"Bacillus alvei",2,2]
[1,"Bacillus anthracis*",2,"2008-03-02","BMBL, vaccination recommended"]
[1,"Bacteroides sp.",2,2]
[1,"Bartonella sp.",3,3]
[1,"Bordetella sp.",2,2]
[1,"Bordetella pertussis",2,"2008-03-02","BMBL"]
[1,"Borrelia sp.",2,2]
[1,"Brucella sp.*","2008-03-02",3,"BMBL"]
[1,"Campylobacter fetus var. jejuni",2,2,"BMBL"]
[1,"Camplobacter sp.",2,2]
[1,"Chlamydia psittaci",2,3,"BMBL"]
[1,"Chlamydia pneumoniae","2008-03-02",2,"BMBL"]
[1,"Chlamydia trachomatis",3,3]
[1,"Clostridium botulinum*","2008-03-02",2,"BMBL"]
[1,"Clostridium tetani",2,null,"BMBL"]
[1,"Corynebacterium diphtheriae",2,2,"BMBL"]
[1,"Corynebacterium equi",2,2]
[1,"Corynebacterium haemolyticum",2,2]
[1,"Corynebacterium pseudotuberculosis",2,2]
[1,"Corynebacterium pysogenes",2,2]
[1,"Corynebacterium renale",2,2]
[1,"Enterobacteriaceae all other",2,2]
[1,"Erysipelothrix rhusiopathiae",2,2]
[1,"Escherichia coli",2,2]
[1,"Escherichia coli K12 derivative",1,1]
[1,"Francisella tularensis*","2008-03-02",3,"BMBL"]
[1,"Fusobacterium sp.",2,2]
[1,"Haemophilus sp.",2,2]
[1,"Klebsiella sp.",2,2]
[1,"Legionella pneumophilia","2-3",2,"BMBL"]
[1,"Leptospira interrogans all servars",2,2,"BMBL"]
[1,"Listeria sp.",2,2]
[1,"Moraxella sp.",2,2]
[1,"Mycobacterium avium",2,2]
[1,"Mycobacterium bovis",3,3,"BMBL"]
[1,"Mycobacterium leprae",2,2,"BMBL"]
[1,"Mycobacterium sp.",2,2,"BMBL"]
[1,"Mycobacterium tuberculosis","2-3","2-3","BMBL"]
[1,"Mycoplasma sp.",2,2]
[1,"Neisseria gonorrhoreae","2-3",2,"BMBL"]
[1,"Neisseria menegitidis","2-3",2,"BMBL"]
[1,"Nocardia sp.",2,2]
[1,"Pasteurella sp.",2,2]
[1,"Pseudomonas mallei","2-3",3,"BMBL"]
[1,"Neisseria gonorrhoeae","2-3",2,"BMBL"]
[1,"Pseudomonas testoserone",2,2]
[1,"Rotococcus (Coryne.) equi",2,2]
[1,"Salmonella sp.",2,2,"BMBL"]
[1,"Salmonella typhi","2-3",2,"BMBL"]
[1,"Shigella sp.",2,2,"BMBL"]
[1,"Staphylococcus sp.",2,2]
[1,"Streptococcus sp.",2,2]
[1,"Streptocacillus moniliformis",2,2]
[1,"Streptomyces somaliensis",2,2]
[1,"Treponema pallidum",2,2,"BMBL"]
[1,"Vibrio sp.",2,2,"BMBL"]
[1,"Yersinia pestis*","2-3",3,"BMBL, immunization recommended"]

{"sheet":"MANTAR","index":3,"n_rows":11,"n_cols":5,"rows_kept":11,"cut":false,"hidden":true,"merged":[]}
[2,"Blastomyces dermatitides",2,2,"BMBL"]
[2,"Coccidioides immitis*","2-3",2,"BMBL"]
[2,"Cryptococcus neoformans",2,2,"BMBL"]
[2,"Epidermophyton - pathogenic sp.",2,2,"BMBL"]
[2,"Histoplasma capsulatum","2-3",2,"BMBL"]
[2,"Microsporum - pathogenic sp.",2,2,"BMBL"]
[2,"Paracoccidioides brasilienisis",2,2]
[2,"Sporothrix schenckii",2,2,"BMBL"]
[2,"Trichophyton - pathogenic sp.",2,2,"BMBL"]
[2,"Candida albicans",2,2]
[2,"Miscellaneous Molds",2,null,"BMBL"]

{"sheet":"PARAZIT","index":4,"n_rows":24,"n_cols":5,"rows_kept":24,"cut":false,"hidden":true,"merged":[]}
[3,"Anaplasma sp.",2,2]
[3,"Ascaris sp.",2,2,"BMBL"]
[3,"Coccidia sp.",2,2,"BMBL"]
[3,"Cryptosporidia sp.",2,2,"BMBL"]
[3,"Echinococcus Granulosus",2,2,"BMBL"]
[3,"Ehrlichia sp.",2,2]
[3,"Entamoeba sp.",2,2,"BMBL"]
[3,"Enterobius sp.",2,2,"BMBL"]
[3,"Fasciola sp.",2,2,"BMBL"]
[3,"Giardia sp.",2,2,"BMBL"]
[3,"Haemobartonella sp.",2,2]
[3,"Hymenolepsis nana",2,2,"BMBL"]
[3,"Leishmania sp.",2,2,"BMBL"]
[3,"Leukocytozoon sp.",2,2]
[3,"Naegleria sp.",2,2]
[3,"Plasmodium sp.",2,2,"BMBL"]
[3,"Sarcocystis sp.",2,2,"BMBL"]
[3,"Schistosoma sp.",2,2,"BMBL"]
[3,"Strongyloides sp.",2,2,"BMBL"]
[3,"Taenia solium",2,2]
[3,"Toxocara canis",2,2]
[3,"Toxoplasma sp.",2,2,"BMBL"]
[3,"Trichinella spiralis",2,2,"BMBL"]
[3,"Trypanosoma sp.",2,2,"BMBL"]

{"sheet":"RIKETSIYA","index":5,"n_rows":13,"n_cols":5,"rows_kept":13,"cut":false,"hidden":true,"merged":[]}
[4,"oxiella burnetii*","2-3",3,"BMBL"]
[4,"Rickettsia akari","2-3","2-3"]
[4,"Rickettsia australis","2-3","2-3","BMBL"]
[4,"Rickettsia canada","2-3","2-3","BMBL"]
[4,"Rickettsia conorii","2-3","2-3","BMBL"]
[4,"Rickettsia prowazekii*","2-3","2-3","BMBL"]
[4,"Rickettsia rickettsii*","2-3","2-3","BMBL"]
[4,"Rickettsia siberica","2-3","2-3","BMBL"]
[4,"Rickettsia tsutsugamushi","2-3","2-3","BMBL"]
[4,"Rickettsia typhi (R. mooseri)","2-3","2-3","BMBL"]
[4,"Rochalimaea quintana",2,2]
[4,"Rochalimaea vinsonii",2,2]
[4,"Spotted Fever Group - other","2-3","2-3"]

{"sheet":"VIRUS","index":6,"n_rows":98,"n_cols":5,"rows_kept":98,"cut":false,"hidden":true,"merged":[]}
[null,"Adenoviruses",2,2]
[null,"Adenoviruses - animal - all",2,2]
[null,"Aleutian Disease Virus",2,2]
[null,"Arboviruses - certain",2,2,"BMBL"]
[null,"Arboviruses - certain",3,3,"BMBL"]
[null,"Arboviruses - certain",4,4,"BMBL"]
[null,"Arenaviruses - certain",3,3,"BMBL"]
[null,"Arenaviruses - certain",4,4,"BMBL"]
[null,"Avian Erthyroblastosis Virus",2,2]
[null,"Avian Leucosis Virus",2,2]
[null,"Avian Lymphomatosis Virus",2,2]
[null,"Avian Myeloblasotosos Virus",2,2]
[null,"Bovine Encephalomyelitis Virus",2,2]
[null,"Bovine Leukemia Virus",2,2]
[null,"Bovine Respiratory Syncytial Virus",2,2]
[null,"Bovine Rhinotracheitis (IBR)",2,2]
[null,"Cache Valley Virus",2,2,"BMBL"]
[null,"Canine Hepatitis Virus",2,2]
[null,"Canine Distemper Virus",2,2]
[null,"Caprine Arthritis",2,2]
[null,"Coxsackie A & B Viruses",2,2]
[null,"Cytomegaloviruses",2,2]
[null,"Encephalomyelitis Virus*",2,2]
[null,"Echovirus",2,2]
[null,"Dengue Virus",2,3,"BMBL"]
[null,"Encephalomyocarditis Virus",2,2]
[null,"Epidemic Diarrhea Infant Mice",2,2]
[null,"Epstein-Barr Virus",2,2]
[null,"Feline Leukemia Virus",2,2]
[null,"Feline Sarcoma Virus",2,2]
[null,"Filoviruses",2,2]
[null,"Flanders Virus",2,2,"BMBL"]
[null,"Gibbon Ape Lymphosarcoma",2,2]
[null,"Hart Park Virus",2,2,"BMBL"]
[null,"Hemorrhagic Fever Agents*",2,2]
[null,"Hepatitis A Virus, Hepatitis E Virus",2,2,"BMBL"]
[null,"Hepatitis B Virus, Hepatitis C Virus, Hepatitis D Virus",2,2,"BMBL"]
[null,"Herpesvirus - other",2,2]
[null,"Herpesvirus ateles",2,2]
[null,"Herpesvirus saimir",2,2]
[null,"Herpesvirus Simiae (B-virus)",3,3,"BSL-2, -3 or -4 depending on activity, BMBL"]
[null,"Human Herpesviruses",2,2,"BMBL"]
[null,"Hog Cholera Virus",2,2]
[null,"Human T-Cell Leukemia Virus I & II",2,2]
[null,"Infectious Bronchitis Virus",2,2]
[null,"Influenza Virus",2,2,"BMBL"]
[null,"Influenza Virus Virulent Avian",3,3]
[null,"K (Rate) Virus",2,2]
[null,"Lactic Dehydrogenase Elevating",2,2]
[null,"Langat Virus",2,2,"BMBL"]
[null,"Laryngotracheitis Virus",2,2]
[null,"Lassa Virus*",4,4,"BMBL"]
[null,"Low Risk Oncogenic Viruses",2,2]
[null,"Lymphocytic Choriomeningitis Virus","2-3","2-3","BMBL"]
[null,"Marburg Virus*",4,4,"BMBL"]
[null,"Measles Virus",2,2]
[null,"Memingopneumonitis Virus",2,2]
[null,"Mouse Encephalomyelitis Virus",2,2]
[null,"Mouse Hepatitis Virus",2,2]
[null,"Mouse Leukemia Virus",2,2]
[null,"Mouse Pneumonia Virus",2,2]
[null,"Mumps Virus",2,2]
[null,"Myxomatosis Virus",2,2]
[null,"Newcastle Disease Virus",2,2]
[null,"Newcastle Disease Virus (VVND)",2,2]
[null,"Non-Defective Adenovirus 2SV40 HYB",2,2]
[null,"Papilloma Virus Shope",2,2]
[null,"Parainfluenza Virus",2,2]
[null,"Poliovirus - all types",2,2,"BMBL"]
[null,"Polyoma Virus",2,2]
[null,"Poxvirus alastrim",2,2]
[null,"Poxvirus monkey pox",3,3]
[null,"Poxvirus - Smallpox*",null,null,"restricted use by WHO"]
[null,"Poxvirus sp.",2,2,"BMBL"]
[null,"Pseudorabies Virus",2,2]
[null,"Rabies Virus","2-3","2-3","BMBL"]
[null,"Reovirus sp.",2,2]
[null,"Respiratory Syncytial Virus",2,2]
[null,"Retroviruses, including HIV & SIV","2-3","2-3","BMBL"]
[null,"Rhinovirus sp.",2,2]
[null,"Rous Sarcoma Virus",2,2]
[5,"Rubella Virus",2,2]
[5,"Simian Virus - other",2,2]
[5,"Simian T-Cell Leukemia Virus",2,2]
[5,"Sindbis Virus",2,2]
[5,"Slow Viruses",2,2]
[5,"Tensaw Virus",2,2]
[5,"Tick-Borne Encephalitis Complex",4,4]
[5,"Transmissible Spongiform Encephalopathies (Creutzfeldt-Jakob, kuru, and related agents",2,2,"BMBL"]
[5,"Turlock Virus",2,2]
[5,"Vaccinia Virus",2,2]
[5,"Venezuelan Equine Encephalitis*",3,3]
[5,"Vesicular Stomatitis - lab adapted",2,2,"BMBL"]
[5,"Vesicular Somatitis Virus",3,3,"BMBL"]
[5,"Woolly Monkey Fibrosarcoma",3,3]
[5,"Yaba Virus",2,2]
[5,"Yellow Fever Virus 17D Strain*",2,2,"BMBL"]
[5,"Yellow Fever Virus Except 17D*",3,3,"BMBL"]

{"sheet":"PRION","index":7,"n_rows":1,"n_cols":1,"rows_kept":1,"cut":false,"hidden":true,"merged":[]}
[6]

{"sheet":"TOKSIN","index":8,"n_rows":1,"n_cols":1,"rows_kept":1,"cut":false,"hidden":true,"merged":[]}
[7]

{"sheet":"A","index":9,"n_rows":8,"n_cols":2,"rows_kept":8,"cut":false,"hidden":true,"merged":[]}
["BAKTERİ",1]
["MANTAR",2]
["PARAZİT",3]
["RİKETSİYA",4]
["VİRÜS",5]
["PRİON",6]
["TOKSİN",7]
["BÜTÜN MİKROORGANİZMALAR",8]

{"sheet":"B","index":10,"n_rows":76,"n_cols":11,"rows_kept":76,"cut":false,"hidden":true,"merged":[]}
["MİKROORGANİZMA","KOD","PATOJEN",null,null,null,null,null,null,"BSL","ABSL"]
["BAKTERİ",{"$f":"IF(A2=0,0,VLOOKUP(A2,A!A1:B8,2,FALSE))","v":1},{"$f":"IF($B$2=0,0,VLOOKUP($B$2,BAKTERI!A1:E62,2,FALSE))","v":"Actinetobacter calceticus"},{"$f":"IF($B$2=0,0,VLOOKUP($B$2,MANTAR!A1:E11,2,FALSE))","v":{"$error":"#N/A"}}]
[null,null,{"$f":"IF($B$2=0,0,VLOOKUP($B$2,BAKTERI!A1:E63,2,FALSE))","v":"Actinetobacter calceticus"}]
[null,null,{"$f":"IF($B$2=0,0,VLOOKUP($B$2,BAKTERI!A2:E64,2,FALSE))","v":"Actinobacillus sp."}]
[null,null,{"$f":"IF($B$2=0,0,VLOOKUP($B$2,BAKTERI!A3:E65,2,FALSE))","v":"Actinomyces sp."}]
[null,null,{"$f":"IF($B$2=0,0,VLOOKUP($B$2,BAKTERI!A4:E66,2,FALSE))","v":"Aeromaonas sp."}]
[null,null,{"$f":"IF($B$2=0,0,VLOOKUP($B$2,BAKTERI!A5:E67,2,FALSE))","v":"Arachnida propionica"}]
[null,null,{"$f":"IF($B$2=0,0,VLOOKUP($B$2,BAKTERI!A6:E68,2,FALSE))","v":"Bacillus alvei"}]
[null,null,{"$f":"IF($B$2=0,0,VLOOKUP($B$2,BAKTERI!A7:E69,2,FALSE))","v":"Bacillus anthracis*"}]
[null,null,{"$f":"IF($B$2=0,0,VLOOKUP($B$2,BAKTERI!A8:E70,2,FALSE))","v":"Bacteroides sp."}]
[null,null,{"$f":"IF($B$2=0,0,VLOOKUP($B$2,BAKTERI!A9:E71,2,FALSE))","v":"Bartonella sp."}]
[null,null,{"$f":"IF($B$2=0,0,VLOOKUP($B$2,BAKTERI!A10:E72,2,FALSE))","v":"Bordetella sp."}]
[null,null,{"$f":"IF($B$2=0,0,VLOOKUP($B$2,BAKTERI!A11:E73,2,FALSE))","v":"Bordetella pertussis"}]
[null,null,{"$f":"IF($B$2=0,0,VLOOKUP($B$2,BAKTERI!A12:E74,2,FALSE))","v":"Borrelia sp."}]
[null,null,{"$f":"IF($B$2=0,0,VLOOKUP($B$2,BAKTERI!A13:E75,2,FALSE))","v":"Brucella sp.*"}]
[null,null,{"$f":"IF($B$2=0,0,VLOOKUP($B$2,BAKTERI!A14:E76,2,FALSE))","v":"Campylobacter fetus var. jejuni"}]
[null,null,{"$f":"IF($B$2=0,0,VLOOKUP($B$2,BAKTERI!A15:E77,2,FALSE))","v":"Camplobacter sp."}]
[null,null,{"$f":"IF($B$2=0,0,VLOOKUP($B$2,BAKTERI!A16:E78,2,FALSE))","v":"Chlamydia psittaci"}]
[null,null,{"$f":"IF($B$2=0,0,VLOOKUP($B$2,BAKTERI!A17:E79,2,FALSE))","v":"Chlamydia pneumoniae"}]
[null,null,{"$f":"IF($B$2=0,0,VLOOKUP($B$2,BAKTERI!A18:E80,2,FALSE))","v":"Chlamydia trachomatis"}]
[null,null,{"$f":"IF($B$2=0,0,VLOOKUP($B$2,BAKTERI!A19:E81,2,FALSE))","v":"Clostridium botulinum*"}]
[null,null,{"$f":"IF($B$2=0,0,VLOOKUP($B$2,BAKTERI!A20:E82,2,FALSE))","v":"Clostridium tetani"}]
[null,null,{"$f":"IF($B$2=0,0,VLOOKUP($B$2,BAKTERI!A21:E83,2,FALSE))","v":"Corynebacterium diphtheriae"}]
[null,null,{"$f":"IF($B$2=0,0,VLOOKUP($B$2,BAKTERI!A22:E84,2,FALSE))","v":"Corynebacterium equi"}]
[null,null,{"$f":"IF($B$2=0,0,VLOOKUP($B$2,BAKTERI!A23:E85,2,FALSE))","v":"Corynebacterium haemolyticum"}]
[null,null,{"$f":"IF($B$2=0,0,VLOOKUP($B$2,BAKTERI!A24:E86,2,FALSE))","v":"Corynebacterium pseudotuberculosis"}]
[null,null,{"$f":"IF($B$2=0,0,VLOOKUP($B$2,BAKTERI!A25:E87,2,FALSE))","v":"Corynebacterium pysogenes"}]
[null,null,{"$f":"IF($B$2=0,0,VLOOKUP($B$2,BAKTERI!A26:E88,2,FALSE))","v":"Corynebacterium renale"}]
[null,null,{"$f":"IF($B$2=0,0,VLOOKUP($B$2,BAKTERI!A27:E89,2,FALSE))","v":"Enterobacteriaceae all other"}]
[null,null,{"$f":"IF($B$2=0,0,VLOOKUP($B$2,BAKTERI!A28:E90,2,FALSE))","v":"Erysipelothrix rhusiopathiae"}]
[null,null,{"$f":"IF($B$2=0,0,VLOOKUP($B$2,BAKTERI!A29:E91,2,FALSE))","v":"Escherichia coli"}]
[null,null,{"$f":"IF($B$2=0,0,VLOOKUP($B$2,BAKTERI!A30:E92,2,FALSE))","v":"Escherichia coli K12 derivative"}]
[null,null,{"$f":"IF($B$2=0,0,VLOOKUP($B$2,BAKTERI!A31:E93,2,FALSE))","v":"Francisella tularensis*"}]
[null,null,{"$f":"IF($B$2=0,0,VLOOKUP($B$2,BAKTERI!A32:E94,2,FALSE))","v":"Fusobacterium sp."}]
[null,null,{"$f":"IF($B$2=0,0,VLOOKUP($B$2,BAKTERI!A33:E95,2,FALSE))","v":"Haemophilus sp."}]
[null,null,{"$f":"IF($B$2=0,0,VLOOKUP($B$2,BAKTERI!A34:E96,2,FALSE))","v":"Klebsiella sp."}]
[null,null,{"$f":"IF($B$2=0,0,VLOOKUP($B$2,BAKTERI!A35:E97,2,FALSE))","v":"Legionella pneumophilia"}]
[null,null,{"$f":"IF($B$2=0,0,VLOOKUP($B$2,BAKTERI!A36:E98,2,FALSE))","v":"Leptospira interrogans all servars"}]
[null,null,{"$f":"IF($B$2=0,0,VLOOKUP($B$2,BAKTERI!A37:E99,2,FALSE))","v":"Listeria sp."}]
[null,null,{"$f":"IF($B$2=0,0,VLOOKUP($B$2,BAKTERI!A38:E100,2,FALSE))","v":"Moraxella sp."}]
[null,null,{"$f":"IF($B$2=0,0,VLOOKUP($B$2,BAKTERI!A39:E101,2,FALSE))","v":"Mycobacterium avium"}]
[null,null,{"$f":"IF($B$2=0,0,VLOOKUP($B$2,BAKTERI!A40:E102,2,FALSE))","v":"Mycobacterium bovis"}]
[null,null,{"$f":"IF($B$2=0,0,VLOOKUP($B$2,BAKTERI!A41:E103,2,FALSE))","v":"Mycobacterium leprae"}]
[null,null,{"$f":"IF($B$2=0,0,VLOOKUP($B$2,BAKTERI!A42:E104,2,FALSE))","v":"Mycobacterium sp."}]
[null,null,{"$f":"IF($B$2=0,0,VLOOKUP($B$2,BAKTERI!A43:E105,2,FALSE))","v":"Mycobacterium tuberculosis"}]
[null,null,{"$f":"IF($B$2=0,0,VLOOKUP($B$2,BAKTERI!A44:E106,2,FALSE))","v":"Mycoplasma sp."}]
[null,null,{"$f":"IF($B$2=0,0,VLOOKUP($B$2,BAKTERI!A45:E107,2,FALSE))","v":"Neisseria gonorrhoreae"}]
[null,null,{"$f":"IF($B$2=0,0,VLOOKUP($B$2,BAKTERI!A46:E108,2,FALSE))","v":"Neisseria menegitidis"}]
[null,null,{"$f":"IF($B$2=0,0,VLOOKUP($B$2,BAKTERI!A47:E109,2,FALSE))","v":"Nocardia sp."}]
[null,null,{"$f":"IF($B$2=0,0,VLOOKUP($B$2,BAKTERI!A48:E110,2,FALSE))","v":"Pasteurella sp."}]
[null,null,{"$f":"IF($B$2=0,0,VLOOKUP($B$2,BAKTERI!A49:E111,2,FALSE))","v":"Pseudomonas mallei"}]
[null,null,{"$f":"IF($B$2=0,0,VLOOKUP($B$2,BAKTERI!A50:E112,2,FALSE))","v":"Neisseria gonorrhoeae"}]
[null,null,{"$f":"IF($B$2=0,0,VLOOKUP($B$2,BAKTERI!A51:E113,2,FALSE))","v":"Pseudomonas testoserone"}]
[null,null,{"$f":"IF($B$2=0,0,VLOOKUP($B$2,BAKTERI!A52:E114,2,FALSE))","v":"Rotococcus (Coryne.) equi"}]
[null,null,{"$f":"IF($B$2=0,0,VLOOKUP($B$2,BAKTERI!A53:E115,2,FALSE))","v":"Salmonella sp."}]
[null,null,{"$f":"IF($B$2=0,0,VLOOKUP($B$2,BAKTERI!A54:E116,2,FALSE))","v":"Salmonella typhi"}]
[null,null,{"$f":"IF($B$2=0,0,VLOOKUP($B$2,BAKTERI!A55:E117,2,FALSE))","v":"Shigella sp."}]
[null,null,{"$f":"IF($B$2=0,0,VLOOKUP($B$2,BAKTERI!A56:E118,2,FALSE))","v":"Staphylococcus sp."}]
[null,null,{"$f":"IF($B$2=0,0,VLOOKUP($B$2,BAKTERI!A57:E119,2,FALSE))","v":"Streptococcus sp."}]
[null,null,{"$f":"IF($B$2=0,0,VLOOKUP($B$2,BAKTERI!A58:E120,2,FALSE))","v":"Streptocacillus moniliformis"}]
[null,null,{"$f":"IF($B$2=0,0,VLOOKUP($B$2,BAKTERI!A59:E121,2,FALSE))","v":"Streptomyces somaliensis"}]
[null,null,{"$f":"IF($B$2=0,0,VLOOKUP($B$2,BAKTERI!A60:E122,2,FALSE))","v":"Treponema pallidum"}]
[null,null,{"$f":"IF($B$2=0,0,VLOOKUP($B$2,BAKTERI!A61:E123,2,FALSE))","v":"Vibrio sp."}]
[null,null,{"$f":"IF($B$2=0,0,VLOOKUP($B$2,BAKTERI!A62:E124,2,FALSE))","v":"Yersinia pestis*"}]
[null,null,{"$f":"IF($B$2=0,0,VLOOKUP($B$2,BAKTERI!A63:E125,2,FALSE))","v":{"$error":"#N/A"}}]
[null,null,{"$f":"IF($B$2=0,0,VLOOKUP($B$2,BAKTERI!A64:E126,2,FALSE))","v":{"$error":"#N/A"}}]
[null,null,{"$f":"IF($B$2=0,0,VLOOKUP($B$2,BAKTERI!A65:E127,2,FALSE))","v":{"$error":"#N/A"}}]
[null,null,{"$f":"IF($B$2=0,0,VLOOKUP($B$2,BAKTERI!A66:E128,2,FALSE))","v":{"$error":"#N/A"}}]
[null,null,{"$f":"IF($B$2=0,0,VLOOKUP($B$2,BAKTERI!A67:E129,2,FALSE))","v":{"$error":"#N/A"}}]
[null,null,{"$f":"IF($B$2=0,0,VLOOKUP($B$2,BAKTERI!A68:E130,2,FALSE))","v":{"$error":"#N/A"}}]
[null,null,{"$f":"IF($B$2=0,0,VLOOKUP($B$2,BAKTERI!A69:E131,2,FALSE))","v":{"$error":"#N/A"}}]
[null,null,{"$f":"IF($B$2=0,0,VLOOKUP($B$2,BAKTERI!A70:E132,2,FALSE))","v":{"$error":"#N/A"}}]
[null,null,{"$f":"IF($B$2=0,0,VLOOKUP($B$2,BAKTERI!A71:E133,2,FALSE))","v":{"$error":"#N/A"}}]
[null,null,{"$f":"IF($B$2=0,0,VLOOKUP($B$2,BAKTERI!A72:E134,2,FALSE))","v":{"$error":"#N/A"}}]
[null,null,{"$f":"IF($B$2=0,0,VLOOKUP($B$2,BAKTERI!A73:E135,2,FALSE))","v":{"$error":"#N/A"}}]
[null,null,{"$f":"IF($B$2=0,0,VLOOKUP($B$2,BAKTERI!A74:E136,2,FALSE))","v":{"$error":"#N/A"}}]